Reaction Details
TargetCarbonic anhydrase 1
LigandBDBM50018628
Substrate/Competitorn/a
Meas. Tech.ChEMBL_1362445 (CHEMBL3292801)
IC50>10000±n/a nM
Citation Tauro, MLoiodice, FCeruso, MSupuran, CTTortorella, P Dual carbonic anhydrase/matrix metalloproteinase inhibitors incorporating bisphosphonic acid moieties targeting bone tumors. Bioorg Med Chem Lett24:2617-20 (2014) 
 
Carbonic anhydrase 1
Name:Carbonic anhydrase 1
Type:Enzyme
Mol. Mass.:28873.37
Organism:Homo sapiens (Human)
Description:P00915
Residue:261
BDBM50018628
NameBDBM50018628
Synonyms:CHEMBL3291003
TypeSmall organic molecule
Emp. Form.C8H10BrNO7P2
Mol. Mass.374.019
SMILESOP(O)(=O)C(NC(=O)c1ccc(Br)cc1)P(O)(O)=O