Reaction Details
TargetCarbonic anhydrase 2
LigandBDBM50018628
Substrate/Competitorn/a
Meas. Tech.ChEMBL_1362446 (CHEMBL3292802)
IC50>10000±n/a nM
Citation Tauro, MLoiodice, FCeruso, MSupuran, CTTortorella, P Dual carbonic anhydrase/matrix metalloproteinase inhibitors incorporating bisphosphonic acid moieties targeting bone tumors. Bioorg Med Chem Lett24:2617-20 (2014) 
 
Carbonic anhydrase 2
Name:Carbonic anhydrase 2
Type:Enzyme
Mol. Mass.:29250.71
Organism:Homo sapiens (Human)
Description:P00918
Residue:260
BDBM50018628
NameBDBM50018628
Synonyms:CHEMBL3291003
TypeSmall organic molecule
Emp. Form.C8H10BrNO7P2
Mol. Mass.374.019
SMILESOP(O)(=O)C(NC(=O)c1ccc(Br)cc1)P(O)(O)=O