Reaction Details
Target72 kDa type IV collagenase
LigandBDBM50018610
Substrate/Competitorn/a
Meas. Tech.ChEMBL_1362451 (CHEMBL3292807)
IC50 15800±n/a nM
Citation Tauro, MLoiodice, FCeruso, MSupuran, CTTortorella, P Dual carbonic anhydrase/matrix metalloproteinase inhibitors incorporating bisphosphonic acid moieties targeting bone tumors. Bioorg Med Chem Lett24:2617-20 (2014) 
 
72 kDa type IV collagenase
Name:72 kDa type IV collagenase
Type:Enzyme
Mol. Mass.:73870.36
Organism:Homo sapiens (Human)
Description: P08253
Residue:660
BDBM50018610
NameBDBM50018610
Synonyms:CHEMBL3291000
TypeSmall organic molecule
Emp. Form.C7H11NO8P2S
Mol. Mass.331.177
SMILESOP(O)(=O)C(NS(=O)(=O)c1ccccc1)P(O)(O)=O