Reaction Details
Target72 kDa type IV collagenase
LigandBDBM50018630
Substrate/Competitorn/a
Meas. Tech.ChEMBL_1362451 (CHEMBL3292807)
IC50 18000±n/a nM
Citation Tauro, MLoiodice, FCeruso, MSupuran, CTTortorella, P Dual carbonic anhydrase/matrix metalloproteinase inhibitors incorporating bisphosphonic acid moieties targeting bone tumors. Bioorg Med Chem Lett24:2617-20 (2014) 
 
72 kDa type IV collagenase
Name:72 kDa type IV collagenase
Type:Enzyme
Mol. Mass.:73870.36
Organism:Homo sapiens (Human)
Description: P08253
Residue:660
BDBM50018630
NameBDBM50018630
Synonyms:CHEMBL3291005
TypeSmall organic molecule
Emp. Form.C8H13NO8P2S
Mol. Mass.345.203
SMILESCc1ccc(cc1)S(=O)(=O)NC(P(O)(O)=O)P(O)(O)=O