Reaction Details
Target72 kDa type IV collagenase
LigandBDBM50018670
Substrate/Competitorn/a
Meas. Tech.ChEMBL_1362451 (CHEMBL3292807)
IC50 192±n/a nM
Citation Tauro, MLoiodice, FCeruso, MSupuran, CTTortorella, P Dual carbonic anhydrase/matrix metalloproteinase inhibitors incorporating bisphosphonic acid moieties targeting bone tumors. Bioorg Med Chem Lett24:2617-20 (2014) 
 
72 kDa type IV collagenase
Name:72 kDa type IV collagenase
Type:Enzyme
Mol. Mass.:73870.36
Organism:Homo sapiens (Human)
Description: P08253
Residue:660
BDBM50018670
NameBDBM50018670
Synonyms:CHEMBL3291013
TypeSmall organic molecule
Emp. Form.C13H14N2O10P2S
Mol. Mass.452.27
SMILESOP(O)(=O)C(NS(=O)(=O)c1ccc(cc1)-c1ccc(cc1)[N+]([O-])=O)P(O)(O)=O