Reaction Details
TargetCarbonic anhydrase 9
LigandBDBM50018630
Substrate/Competitorn/a
Meas. Tech.ChEMBL_1362447 (CHEMBL3292803)
IC50 200±n/a nM
Citation Tauro, MLoiodice, FCeruso, MSupuran, CTTortorella, P Dual carbonic anhydrase/matrix metalloproteinase inhibitors incorporating bisphosphonic acid moieties targeting bone tumors. Bioorg Med Chem Lett24:2617-20 (2014) 
 
Carbonic anhydrase 9
Name:Carbonic anhydrase 9
Type:Enzyme
Mol. Mass.:49669.03
Organism:Homo sapiens (Human)
Description:Catalytic domain of human cloned isozyme was used in the assay
Residue:459
BDBM50018630
NameBDBM50018630
Synonyms:CHEMBL3291005
TypeSmall organic molecule
Emp. Form.C8H13NO8P2S
Mol. Mass.345.203
SMILESCc1ccc(cc1)S(=O)(=O)NC(P(O)(O)=O)P(O)(O)=O