Reaction Details
TargetCarbonic anhydrase 14
LigandBDBM50018641
Substrate/Competitorn/a
Meas. Tech.ChEMBL_1362449 (CHEMBL3292805)
IC50 516±n/a nM
Citation Tauro, MLoiodice, FCeruso, MSupuran, CTTortorella, P Dual carbonic anhydrase/matrix metalloproteinase inhibitors incorporating bisphosphonic acid moieties targeting bone tumors. Bioorg Med Chem Lett24:2617-20 (2014) 
 
Carbonic anhydrase 14
Name:Carbonic anhydrase 14
Type:Enzyme
Mol. Mass.:37665.67
Organism:Homo sapiens (Human)
Description:Human (cloned) isozyme.
Residue:337
BDBM50018641
NameBDBM50018641
Synonyms:CHEMBL3291006
TypeSmall organic molecule
Emp. Form.C8H13NO9P2S
Mol. Mass.361.203
SMILESCOc1ccc(cc1)S(=O)(=O)NC(P(O)(O)=O)P(O)(O)=O