Reaction Details
TargetAmine oxidase [flavin-containing] A
LigandBDBM50018671
Substrate/Competitorn/a
Meas. Tech.ChEMBL_1362470 (CHEMBL3293071)
IC50 2300±n/a nM
Citation Wang, LEsteban, GOjima, MBautista-Aguilera, OMInokuchi, TMoraleda, IIriepa, ISamadi, AYoudim, MBRomero, ASoriano, EHerrero, RFernández Fernández, APRicardo-Martínez-Murillo, naMarco-Contelles, JUnzeta, M Donepezil + propargylamine + 8-hydroxyquinoline hybrids as new multifunctional metal-chelators, ChE and MAO inhibitors for the potential treatment of Alzheimer's disease. Eur J Med Chem80:543-61 (2014) 
 
Amine oxidase [flavin-containing] A
Name:Amine oxidase [flavin-containing] A
Type:Enzyme
Mol. Mass.:59515.21
Organism:Rattus norvegicus (rat)
Description:n/a
Residue:526
BDBM50018671
NameBDBM50018671
Synonyms:CHEMBL3291019
TypeSmall organic molecule
Emp. Form.C29H32N4O
Mol. Mass.452.5906
SMILESOc1ccc(CN(CC#C)C(CCC2CCN(Cc3ccccc3)CC2)C#N)c2cccnc12