Reaction Details
TargetCytochrome P450 3A4
LigandBDBM50018769
Substrate/Competitorn/a
Meas. Tech.ChEMBL_1362864 (CHEMBL3291638)
IC50 6100±n/a nM
Citation Gillespie, PPietranico-Cole, SMyers, MBilotta, JAConde-Knape, KFotouhi, NGoodnow, RAGuertin, KRHamilton, MMHaynes, NELiu, BQi, LRen, YScott, NRSo, SSSpence, CTaub, RThakkar, KTilley, JWZwingelstein, C Discovery of camphor-derived pyrazolones as 11ß-hydroxysteroid dehydrogenase type 1 inhibitors. Bioorg Med Chem Lett24:2707-11 (2014) 
 
Cytochrome P450 3A4
Name:Cytochrome P450 3A4
Type:Enzyme
Mol. Mass.:57349.57
Organism:Homo sapiens (Human)
Description:n/a
Residue:503
BDBM50018769
NameBDBM50018769
Synonyms:CHEMBL3291346
TypeSmall organic molecule
Emp. Form.C24H24F2N2O
Mol. Mass.394.457
SMILES[H][C@@]12CC[C@@](C)(c3c1c(=O)n(-c1ccc(F)cc1F)n3Cc1ccccc1)C2(C)C