Reaction Details
Target11-beta-hydroxysteroid dehydrogenase 1
LigandBDBM50018795
Substrate/Competitorn/a
Meas. Tech.ChEMBL_1362859 (CHEMBL3291633)
IC50 9.0±n/a nM
Citation Gillespie, PPietranico-Cole, SMyers, MBilotta, JAConde-Knape, KFotouhi, NGoodnow, RAGuertin, KRHamilton, MMHaynes, NELiu, BQi, LRen, YScott, NRSo, SSSpence, CTaub, RThakkar, KTilley, JWZwingelstein, C Discovery of camphor-derived pyrazolones as 11ß-hydroxysteroid dehydrogenase type 1 inhibitors. Bioorg Med Chem Lett24:2707-11 (2014) 
 
11-beta-hydroxysteroid dehydrogenase 1
Name:11-beta-hydroxysteroid dehydrogenase 1
Type:Enzyme
Mol. Mass.:32409.16
Organism:Homo sapiens (Human)
Description:P28845
Residue:292
BDBM50018795
NameBDBM50018795
Synonyms:CHEMBL3291339
TypeSmall organic molecule
Emp. Form.C19H24N2O
Mol. Mass.296.4067
SMILES[H][C@@]12CC[C@@](C)(c3c1c(=O)n(-c1ccccc1)n3CC)C2(C)C