Reaction Details
Target11-beta-hydroxysteroid dehydrogenase 1
LigandBDBM50018760
Substrate/Competitorn/a
Meas. Tech.ChEMBL_1362858 (CHEMBL3295808)
IC50 10.0±n/a nM
Citation Gillespie, PPietranico-Cole, SMyers, MBilotta, JAConde-Knape, KFotouhi, NGoodnow, RAGuertin, KRHamilton, MMHaynes, NELiu, BQi, LRen, YScott, NRSo, SSSpence, CTaub, RThakkar, KTilley, JWZwingelstein, C Discovery of camphor-derived pyrazolones as 11ß-hydroxysteroid dehydrogenase type 1 inhibitors. Bioorg Med Chem Lett24:2707-11 (2014) 
 
11-beta-hydroxysteroid dehydrogenase 1
Name:11-beta-hydroxysteroid dehydrogenase 1
Type:Enzyme
Mol. Mass.:31889.48
Organism:Rattus norvegicus (rat)
Description:P16232
Residue:288
BDBM50018760
NameBDBM50018760
Synonyms:CHEMBL3291357
TypeSmall organic molecule
Emp. Form.C20H23F3N2O
Mol. Mass.364.4046
SMILES[H][C@@]12CC[C@@](C)(c3c1c(=O)n(Cc1ccccc1C(F)(F)F)n3C)C2(C)C