Reaction Details
Target11-beta-hydroxysteroid dehydrogenase 1
LigandBDBM50018814
Substrate/Competitorn/a
Meas. Tech.ChEMBL_1362859 (CHEMBL3291633)
IC50>22000±n/a nM
Citation Gillespie, PPietranico-Cole, SMyers, MBilotta, JAConde-Knape, KFotouhi, NGoodnow, RAGuertin, KRHamilton, MMHaynes, NELiu, BQi, LRen, YScott, NRSo, SSSpence, CTaub, RThakkar, KTilley, JWZwingelstein, C Discovery of camphor-derived pyrazolones as 11ß-hydroxysteroid dehydrogenase type 1 inhibitors. Bioorg Med Chem Lett24:2707-11 (2014) 
 
11-beta-hydroxysteroid dehydrogenase 1
Name:11-beta-hydroxysteroid dehydrogenase 1
Type:Enzyme
Mol. Mass.:32409.16
Organism:Homo sapiens (Human)
Description:P28845
Residue:292
BDBM50018814
NameBDBM50018814
Synonyms:CHEMBL3291352
TypeSmall organic molecule
Emp. Form.C19H24N2O
Mol. Mass.296.4067
SMILES[H][C@@]12CC[C@@](C)(c3nn(c(OC)c13)-c1ccc(C)cc1)C2(C)C