Reaction Details
TargetALK tyrosine kinase receptor
LigandBDBM50018842
Substrate/Competitorn/a
Meas. Tech.ChEMBL_1363644 (CHEMBL3293162)
Ki 0.560000±n/a nM
Citation Johnson, TWRichardson, PFBailey, SBrooun, ABurke, BJCollins, MRCui, JJDeal, JGDeng, YLDinh, DEngstrom, LDHe, MHoffman, JHoffman, RLHuang, QKania, RSKath, JCLam, HLam, JLLe, PTLingardo, LLiu, WMcTigue, MPalmer, CLSach, NWSmeal, TSmith, GLStewart, AETimofeevski, SZhu, HZhu, JZou, HYEdwards, MP Discovery of (10R)-7-amino-12-fluoro-2,10,16-trimethyl-15-oxo-10,15,16,17-tetrahydro-2H-8,4-(metheno)pyrazolo[4,3-h][2,5,11]-benzoxadiazacyclotetradecine-3-carbonitrile (PF-06463922), a macrocyclic inhibitor of anaplastic lymphoma kinase (ALK) and c-ros oncogene 1 (ROS1) with preclinical brain expo J Med Chem57:4720-44 (2014) 
 
ALK tyrosine kinase receptor
Name:ALK tyrosine kinase receptor
Type:Protein
Mol. Mass.:176453.10
Organism:Homo sapiens (Human)
Description:Q9UM73
Residue:1620
BDBM50018842
NameBDBM50018842
Synonyms:CHEMBL3286832
TypeSmall organic molecule
Emp. Form.C23H18FN7O2
Mol. Mass.443.4331
SMILESC[C@H]1Oc2nc(cnc2N)-c2c(CN(C)C(=O)c3ccc(F)cc13)nc1ccc(cn21)C#N