Reaction Details
TargetD(3) dopamine receptor
LigandBDBM50130293
Substrate/Competitorn/a
Meas. Tech.ChEMBL_1364911 (CHEMBL3295082)
Ki 3.0±n/a nM
Citation Möller, DKling, RCSkultety, MLeuner, KHübner, HGmeiner, P Functionally selective dopamine D2, D3 receptor partial agonists. J Med Chem57:4861-75 (2014) 
 
D(3) dopamine receptor
Name:D(3) dopamine receptor
Type:n/a
Mol. Mass.:44243.43
Organism:Homo sapiens (Human)
Description:n/a
Residue:400
BDBM50130293
NameBDBM50130293
Synonyms:7-{4-[4-(2,3-dichlorophenyl)piperazin-1-yl]butoxy}-3,4-dihydroquinolin-2(1H)-one CHEMBL1112 US10752588, Compound Aripiprazole US9018213, aripprazole | US9156822, Aripiprazole
TypeSmall organic molecule
Emp. Form.C23H27Cl2N3O2
Mol. Mass.448.385
SMILESClc1cccc(N2CCN(CCCCOc3ccc4CCC(=O)Nc4c3)CC2)c1Cl