Reaction Details
TargetD(3) dopamine receptor
LigandBDBM50443101
Substrate/Competitorn/a
Meas. Tech.ChEMBL_1364911 (CHEMBL3295082)
Ki 0.270000±n/a nM
Citation Möller, DKling, RCSkultety, MLeuner, KHübner, HGmeiner, P Functionally selective dopamine D2, D3 receptor partial agonists. J Med Chem57:4861-75 (2014) 
 
D(3) dopamine receptor
Name:D(3) dopamine receptor
Type:n/a
Mol. Mass.:44243.43
Organism:Homo sapiens (Human)
Description:n/a
Residue:400
BDBM50443101
NameBDBM50443101
Synonyms:Cariprazine | RGH-188
TypeSmall organic molecule
Emp. Form.C21H32Cl2N4O
Mol. Mass.427.411
SMILESCN(C)C(=O)N[C@H]1CC[C@H](CCN2CCN(CC2)c2cccc(Cl)c2Cl)CC1