Reaction Details
TargetAcrosin
LigandBDBM50018989
Substrate/Competitorn/a
Meas. Tech.ChEMBL_1365286 (CHEMBL3292380)
IC50 27900±n/a nM
Citation Zhao, JTian, WQi, JLv, DLiu, YJiang, YDong, GChen, QZhou, YZhu, JWang, HSheng, CLv, J Design and synthesis of phenylisoxazole derivatives as novel human acrosin inhibitors. Bioorg Med Chem Lett24:2802-6 (2014) 
 
Acrosin
Name:Acrosin
Type:PROTEIN
Mol. Mass.:45865.48
Organism:Homo sapiens (Human)
Description:ChEMBL_1365286
Residue:421
BDBM50018989
NameBDBM50018989
Synonyms:CHEMBL3287460
TypeSmall organic molecule
Emp. Form.C17H15BrClN5O2
Mol. Mass.436.69
SMILESCl.NC(=N)Nc1ccc(cc1)-c1cc(no1)C(=O)Nc1ccccc1Br