Reaction Details
TargetKappa-type opioid receptor
LigandBDBM50018997
Substrate/Competitorn/a
Meas. Tech.ChEMBL_1365291 (CHEMBL3292385)
Ki 85±n/a nM
Citation Nagase, HNakajima, RYamamoto, NHirayama, SIwai, TNemoto, TGouda, HHirono, SFujii, H Design and synthesis of quinolinopropellane derivatives with selectived opioid receptor agonism. Bioorg Med Chem Lett24:2851-4 (2014) 
 
Kappa-type opioid receptor
Name:Kappa-type opioid receptor
Type:G Protein-Coupled Receptor (GPCR)
Mol. Mass.:42648.76
Organism:Homo sapiens (Human)
Description:P41145
Residue:380
BDBM50018997
NameBDBM50018997
Synonyms:CHEMBL3287467
TypeSmall organic molecule
Emp. Form.C27H28N2O
Mol. Mass.396.524
SMILESOc1ccc2C[C@@]34CN(CC5CC5)CC[C@@]3(Cc3nc5ccccc5cc3C4)c2c1