Reaction Details
TargetAcetylcholinesterase
LigandBDBM8961
Substrate/Competitorn/a
Meas. Tech.ChEMBL_1366477 (CHEMBL3296431)
IC50 29±n/a nM
Citation Castro, MJRichmond, VRomero, CMaier, MSEstévez-Braun, ARavelo, AGFaraoni, MBMurray, AP Preparation, anticholinesterase activity and molecular docking of new lupane derivatives. Bioorg Med Chem22:3341-50 (2014) 
 
Acetylcholinesterase
Name:Acetylcholinesterase
Type:n/a
Mol. Mass.:65900.74
Organism:Tetronarce californica (Pacific electric ray) (Torpedo californica)
Description:P04058
Residue:586
BDBM8961
NameBDBM8961
Synonyms:1,2,3,4-tetrahydro-9-acridinamine 9-THA CHEMBL1337960 Cognex Tracine cid_1935 | tacrine.HCl
TypeSmall organic molecule
Emp. Form.C13H14N2
Mol. Mass.198.2637
SMILESNc1c2CCCCc2nc2ccccc12