Reaction Details
TargetCholinesterase
LigandBDBM50004000
Substrate/Competitorn/a
Meas. Tech.ChEMBL_1366479 (CHEMBL3296433)
IC50 14±n/a nM
Citation Castro, MJRichmond, VRomero, CMaier, MSEstévez-Braun, ARavelo, AGFaraoni, MBMurray, AP Preparation, anticholinesterase activity and molecular docking of new lupane derivatives. Bioorg Med Chem22:3341-50 (2014) 
 
Cholinesterase
Name:Cholinesterase
Type:Enzyme
Mol. Mass.:65643.35
Organism:Equus caballus (Horse)
Description:P81908
Residue:574
BDBM50004000
NameBDBM50004000
Synonyms:(3aS,8aR)-1,3a,8-trimethyl-1,2,3,3a,8,8a-hexahydropyrrolo[2,3-b]indol-5-yl methylcarbamate CHEMBL94 Physostol | physostigmine
TypeSmall organic molecule
Emp. Form.C15H21N3O2
Mol. Mass.275.3461
SMILESCNC(=O)Oc1ccc2N(C)[C@H]3N(C)CC[C@@]3(C)c2c1