Reaction Details
TargetCholinesterase
LigandBDBM8961
Substrate/Competitorn/a
Meas. Tech.ChEMBL_1366479 (CHEMBL3296433)
IC50 4.0±n/a nM
Citation Castro, MJRichmond, VRomero, CMaier, MSEstévez-Braun, ARavelo, AGFaraoni, MBMurray, AP Preparation, anticholinesterase activity and molecular docking of new lupane derivatives. Bioorg Med Chem22:3341-50 (2014) 
 
Cholinesterase
Name:Cholinesterase
Type:Enzyme
Mol. Mass.:65643.35
Organism:Equus caballus (Horse)
Description:P81908
Residue:574
BDBM8961
NameBDBM8961
Synonyms:1,2,3,4-tetrahydro-9-acridinamine 9-THA CHEMBL1337960 Cognex Tracine cid_1935 | tacrine.HCl
TypeSmall organic molecule
Emp. Form.C13H14N2
Mol. Mass.198.2637
SMILESNc1c2CCCCc2nc2ccccc12