Reaction Details
TargetNeuronal acetylcholine receptor subunit alpha-7
LigandBDBM50019147
Substrate/Competitorn/a
Meas. Tech.ChEMBL_1362137 (CHEMBL3294909)
Ki 9100±n/a nM
Citation Liu, YPaige, MOlson, TTAl-Muhtasib, NXie, THou, SWhite, MPCordova, AGuo, JLKellar, KJXiao, YBrown, ML Synthesis and pharmacological characterization of new neuronal nicotinic acetylcholine receptor ligands derived from Sazetidine-A. Bioorg Med Chem Lett24:2954-6 (2014) 
 
Neuronal acetylcholine receptor subunit alpha-7
Name:Neuronal acetylcholine receptor subunit alpha-7
Type:Enzyme
Mol. Mass.:56502.44
Organism:Rattus norvegicus (Rat)
Description:Q05941
Residue:502
BDBM50019147
NameBDBM50019147
Synonyms:CHEMBL3289074
TypeSmall organic molecule
Emp. Form.C16H22N2O
Mol. Mass.258.3587
SMILESCCCCC#Cc1cncc(OC[C@H]2CCCN2)c1