Reaction Details
TargetNeuronal acetylcholine receptor subunit alpha-7
LigandBDBM50019148
Substrate/Competitorn/a
Meas. Tech.ChEMBL_1362137 (CHEMBL3294909)
Ki 100000±n/a nM
Citation Liu, YPaige, MOlson, TTAl-Muhtasib, NXie, THou, SWhite, MPCordova, AGuo, JLKellar, KJXiao, YBrown, ML Synthesis and pharmacological characterization of new neuronal nicotinic acetylcholine receptor ligands derived from Sazetidine-A. Bioorg Med Chem Lett24:2954-6 (2014) 
 
Neuronal acetylcholine receptor subunit alpha-7
Name:Neuronal acetylcholine receptor subunit alpha-7
Type:Enzyme
Mol. Mass.:56502.44
Organism:Rattus norvegicus (Rat)
Description:Q05941
Residue:502
BDBM50019148
NameBDBM50019148
Synonyms:CHEMBL3289075
TypeSmall organic molecule
Emp. Form.C15H21N5O2
Mol. Mass.303.3595
SMILESOCCCCc1cn(nn1)-c1cncc(OC[C@@H]2CCN2)c1