Reaction Details
TargetBeta-glucuronidase
LigandBDBM50019283
Substrate/Competitorn/a
Meas. Tech.ChEMBL_1362174 (CHEMBL3295183)
IC50 700±n/a nM
Citation Khan, KMSaad, SMShaikh, NNHussain, SFakhri, MIPerveen, STaha, MChoudhary, MI Synthesis andß-glucuronidase inhibitory activity of 2-arylquinazolin-4(3H)-ones. Bioorg Med Chem22:3449-54 (2014) 
 
Beta-glucuronidase
Name:Beta-glucuronidase
Type:Protein
Mol. Mass.:74736.05
Organism:Homo sapiens (Human)
Description:n/a
Residue:651
BDBM50019283
NameBDBM50019283
Synonyms:CHEMBL3289121
TypeSmall organic molecule
Emp. Form.C16H14N2O2
Mol. Mass.266.2946
SMILESCCOc1ccccc1-c1nc2ccccc2c(=O)[nH]1