Reaction Details
TargetEctonucleotide pyrophosphatase/phosphodiesterase family member 1
LigandBDBM50019291
Substrate/Competitorn/a
Meas. Tech.ChEMBL_1362543 (CHEMBL3293572)
Ki 4500±n/a nM
Citation Nadel, YLecka, JGilad, YBen-David, GFörster, DReiser, GKenigsberg, SCamden, JWeisman, GASenderowitz, HSévigny, JFischer, B Highly potent and selective ectonucleotide pyrophosphatase/phosphodiesterase I inhibitors based on an adenosine 5'-(a or¿)-thio-(a,ß- orß,¿)-methylenetriphosphate scaffold. J Med Chem57:4677-91 (2014) 
 
Ectonucleotide pyrophosphatase/phosphodiesterase family member 1
Name:Ectonucleotide pyrophosphatase/phosphodiesterase family member 1
Type:PROTEIN
Mol. Mass.:104934.43
Organism:Homo sapiens (Human)
Description:ChEMBL_1448940
Residue:925
BDBM50019291
NameBDBM50019291
Synonyms:CHEMBL3289392
TypeSmall organic molecule
Emp. Form.C11H18N5O11P3S
Mol. Mass.521.274
SMILESNc1ncnc2n(cnc12)[C@@H]1O[C@H](CO[P@](O)(=S)OP(O)(=O)CP(O)(O)=O)[C@@H](O)[C@H]1O