Reaction Details
TargetP2Y purinoceptor 11
LigandBDBM50019292
Substrate/Competitorn/a
Meas. Tech.ChEMBL_1362532 (CHEMBL3293346)
EC50 900±n/a nM
Citation Nadel, YLecka, JGilad, YBen-David, GFörster, DReiser, GKenigsberg, SCamden, JWeisman, GASenderowitz, HSévigny, JFischer, B Highly potent and selective ectonucleotide pyrophosphatase/phosphodiesterase I inhibitors based on an adenosine 5'-(a or¿)-thio-(a,ß- orß,¿)-methylenetriphosphate scaffold. J Med Chem57:4677-91 (2014) 
 
P2Y purinoceptor 11
Name:P2Y purinoceptor 11
Type:PROTEIN
Mol. Mass.:40366.02
Organism:Homo sapiens (Human)
Description:ChEMBL_1362532
Residue:374
BDBM50019292
NameBDBM50019292
Synonyms:CHEMBL3289393
TypeSmall organic molecule
Emp. Form.C11H18N5O11P3S
Mol. Mass.521.274
SMILESNc1ncnc2n(cnc12)[C@@H]1O[C@H](CO[P@@](O)(=S)OP(O)(=O)CP(O)(O)=O)[C@@H](O)[C@H]1O