Reaction Details
TargetCatechol O-methyltransferase
LigandBDBM50019331
Substrate/Competitorn/a
Meas. Tech.ChEMBL_1362908 (CHEMBL3291950)
Ki 63000±n/a nM
Citation Lanier, MAmbrus, GCole, DCDavenport, REllery, JFosbeary, RJennings, AJKadotani, AKamada, YKamran, RMatsumoto, SMizukami, AOkubo, SOkada, KSaikatendu, KWalsh, LWu, HHixon, MS A fragment-based approach to identifying S-adenosyl-l-methionine -competitive inhibitors of catechol O-methyl transferase (COMT). J Med Chem57:5459-63 (2014) 
 
Catechol O-methyltransferase
Name:Catechol O-methyltransferase
Type:PROTEIN
Mol. Mass.:29482.97
Organism:Mus musculus
Description:ChEMBL_108370
Residue:265
BDBM50019331
NameBDBM50019331
Synonyms:CHEMBL3289430
TypeSmall organic molecule
Emp. Form.C8H10N4
Mol. Mass.162.1918
SMILESCc1nn(C)cc1-c1cc[nH]n1