Reaction Details
TargetCannabinoid receptor 1
LigandBDBM50019392
Substrate/Competitorn/a
Meas. Tech.ChEMBL_1363707 (CHEMBL3293670)
Ki 628±n/a nM
Citation Tepper, MAZurier, RBBurstein, SH Ultrapure ajulemic acid has improved CB2 selectivity with reduced CB1 activity. Bioorg Med Chem22:3245-51 (2014) 
 
Cannabinoid receptor 1
Name:Cannabinoid receptor 1
Type:G Protein-Coupled Receptor (GPCR)
Mol. Mass.:52868.96
Organism:Homo sapiens (Human)
Description:P21554
Residue:472
BDBM50019392
NameBDBM50019392
Synonyms:CHEMBL3290053
TypeSmall organic molecule
Emp. Form.C27H38O5
Mol. Mass.442.5876
SMILES[H][C@@]12CC(=CC[C@@]1([H])C(C)(C)Oc1cc(cc(OC(C)=O)c21)C(C)(C)CCCCCC)C(O)=O