Reaction Details
TargetNeurotensin receptor type 2
LigandBDBM50019415
Substrate/Competitorn/a
Meas. Tech.ChEMBL_1364514 (CHEMBL3295311)
EC50 159±n/a nM
Citation Thomas, JBGiddings, AMWiethe, RWOlepu, SWarner, KRSarret, PGendron, LLongpre, JMZhang, YRunyon, SPGilmour, BP Identification of 1-({[1-(4-fluorophenyl)-5-(2-methoxyphenyl)-1H-pyrazol-3-yl]carbonyl}amino)cyclohexane carboxylic acid as a selective nonpeptide neurotensin receptor type 2 compound. J Med Chem57:5318-32 (2014) 
 
Neurotensin receptor type 2
Name:Neurotensin receptor type 2
Type:PROTEIN
Mol. Mass.:46280.50
Organism:Rattus norvegicus
Description:ChEMBL_1466615
Residue:416
BDBM50019415
NameBDBM50019415
Synonyms:CHEMBL3290099
TypeSmall organic molecule
Emp. Form.C30H31N3O5
Mol. Mass.513.5842
SMILESCOc1cccc(OC)c1-c1cc(nn1-c1cccc2ccccc12)C(=O)N[C@@H](C1CCCCC1)C(O)=O