Reaction Details
TargetNeurotensin receptor type 2
LigandBDBM50019424
Substrate/Competitorn/a
Meas. Tech.ChEMBL_1364516 (CHEMBL3295313)
IC50 153±n/a nM
Citation Thomas, JBGiddings, AMWiethe, RWOlepu, SWarner, KRSarret, PGendron, LLongpre, JMZhang, YRunyon, SPGilmour, BP Identification of 1-({[1-(4-fluorophenyl)-5-(2-methoxyphenyl)-1H-pyrazol-3-yl]carbonyl}amino)cyclohexane carboxylic acid as a selective nonpeptide neurotensin receptor type 2 compound. J Med Chem57:5318-32 (2014) 
 
Neurotensin receptor type 2
Name:Neurotensin receptor type 2
Type:PROTEIN
Mol. Mass.:46280.50
Organism:Rattus norvegicus
Description:ChEMBL_1466615
Residue:416
BDBM50019424
NameBDBM50019424
Synonyms:CHEMBL3290106
TypeSmall organic molecule
Emp. Form.C24H24FN3O4
Mol. Mass.437.4635
SMILESCOc1ccccc1-c1cc(nn1-c1ccc(F)cc1)C(=O)NC1(CCCCC1)C(O)=O