Reaction Details
TargetNeurotensin receptor type 2
LigandBDBM50248034
Substrate/Competitorn/a
Meas. Tech.ChEMBL_1364517 (CHEMBL3295314)
Ki 62±n/a nM
Citation Thomas, JBGiddings, AMWiethe, RWOlepu, SWarner, KRSarret, PGendron, LLongpre, JMZhang, YRunyon, SPGilmour, BP Identification of 1-({[1-(4-fluorophenyl)-5-(2-methoxyphenyl)-1H-pyrazol-3-yl]carbonyl}amino)cyclohexane carboxylic acid as a selective nonpeptide neurotensin receptor type 2 compound. J Med Chem57:5318-32 (2014) 
 
Neurotensin receptor type 2
Name:Neurotensin receptor type 2
Type:PROTEIN
Mol. Mass.:46280.50
Organism:Rattus norvegicus
Description:ChEMBL_1466615
Residue:416
BDBM50248034
NameBDBM50248034
Synonyms:2-{[1-(7-Chloro-quinolin-4-yl)-5-(2,6-dimethoxy-phenyl)-1H-pyrazole-3-carbonyl]-amino}-adamantane-2-carboxylic acid SR 48692
TypeSmall organic molecule
Emp. Form.C32H31ClN4O5
Mol. Mass.587.065
SMILESCOc1cccc(OC)c1-c1cc(nn1-c1ccnc2cc(Cl)ccc12)C(=O)NC1(C2CC3CC(C2)CC1C3)C(O)=O