Reaction Details
TargetNeurotensin receptor type 2
LigandBDBM50019408
Substrate/Competitorn/a
Meas. Tech.ChEMBL_1364517 (CHEMBL3295314)
Ki 1418±n/a nM
Citation Thomas, JBGiddings, AMWiethe, RWOlepu, SWarner, KRSarret, PGendron, LLongpre, JMZhang, YRunyon, SPGilmour, BP Identification of 1-({[1-(4-fluorophenyl)-5-(2-methoxyphenyl)-1H-pyrazol-3-yl]carbonyl}amino)cyclohexane carboxylic acid as a selective nonpeptide neurotensin receptor type 2 compound. J Med Chem57:5318-32 (2014) 
 
Neurotensin receptor type 2
Name:Neurotensin receptor type 2
Type:PROTEIN
Mol. Mass.:46280.50
Organism:Rattus norvegicus
Description:ChEMBL_1466615
Residue:416
BDBM50019408
NameBDBM50019408
Synonyms:CHEMBL3290092
TypeSmall organic molecule
Emp. Form.C28H27ClN4O4
Mol. Mass.518.991
SMILESCOc1ccccc1-c1cc(nn1-c1ccnc2cc(Cl)ccc12)C(=O)N[C@@H](C1CCCCC1)C(O)=O