Reaction Details
TargetCarbonic anhydrase 12
LigandBDBM50019535
Substrate/Competitorn/a
Meas. Tech.ChEMBL_1366562 (CHEMBL3296585)
Ki 44±n/a nM
Citation Slawinski, JPogorzelska, AZolnowska, BBrozewicz, KVullo, DSupuran, CT Carbonic anhydrase inhibitors. Synthesis of a novel series of 5-substituted 2,4-dichlorobenzenesulfonamides and their inhibition of human cytosolic isozymes I and II and the transmembrane tumor-associated isozymes IX and XII. Eur J Med Chem82:47-55 (2014) 
 
Carbonic anhydrase 12
Name:Carbonic anhydrase 12
Type:Enzyme
Mol. Mass.:39456.00
Organism:Homo sapiens (Human)
Description:Catalytic domain of human cloned isozyme was used in the assay
Residue:354
BDBM50019535
NameBDBM50019535
Synonyms:CHEMBL3291103
TypeSmall organic molecule
Emp. Form.C14H20Cl2N4O4S
Mol. Mass.411.304
SMILESNS(=O)(=O)c1cc(NC(=O)NCCCN2CCOCC2)c(Cl)cc1Cl