Reaction Details
TargetCarbonic anhydrase 1
LigandBDBM50019578
Substrate/Competitorn/a
Meas. Tech.ChEMBL_1366559 (CHEMBL3296582)
Ki 718±n/a nM
Citation Slawinski, JPogorzelska, AZolnowska, BBrozewicz, KVullo, DSupuran, CT Carbonic anhydrase inhibitors. Synthesis of a novel series of 5-substituted 2,4-dichlorobenzenesulfonamides and their inhibition of human cytosolic isozymes I and II and the transmembrane tumor-associated isozymes IX and XII. Eur J Med Chem82:47-55 (2014) 
 
Carbonic anhydrase 1
Name:Carbonic anhydrase 1
Type:Enzyme
Mol. Mass.:28873.37
Organism:Homo sapiens (Human)
Description:P00915
Residue:261
BDBM50019578
NameBDBM50019578
Synonyms:CHEMBL3291087
TypeSmall organic molecule
Emp. Form.C9H7Cl2N3O3S
Mol. Mass.308.141
SMILESCc1nnc(o1)-c1cc(c(Cl)cc1Cl)S(N)(=O)=O