Reaction Details
TargetCarbonic anhydrase 1
LigandBDBM50019531
Substrate/Competitorn/a
Meas. Tech.ChEMBL_1366559 (CHEMBL3296582)
Ki 1165±n/a nM
Citation Slawinski, JPogorzelska, AZolnowska, BBrozewicz, KVullo, DSupuran, CT Carbonic anhydrase inhibitors. Synthesis of a novel series of 5-substituted 2,4-dichlorobenzenesulfonamides and their inhibition of human cytosolic isozymes I and II and the transmembrane tumor-associated isozymes IX and XII. Eur J Med Chem82:47-55 (2014) 
 
Carbonic anhydrase 1
Name:Carbonic anhydrase 1
Type:Enzyme
Mol. Mass.:28873.37
Organism:Homo sapiens (Human)
Description:P00915
Residue:261
BDBM50019531
NameBDBM50019531
Synonyms:CHEMBL3291099
TypeSmall organic molecule
Emp. Form.C14H13Cl2N3O3S
Mol. Mass.374.242
SMILESNS(=O)(=O)c1cc(NC(=O)NCc2ccccc2)c(Cl)cc1Cl