Reaction Details
TargetCarbonic anhydrase 2
LigandBDBM50019585
Substrate/Competitorn/a
Meas. Tech.ChEMBL_1366560 (CHEMBL3296583)
Ki 29±n/a nM
Citation Slawinski, JPogorzelska, AZolnowska, BBrozewicz, KVullo, DSupuran, CT Carbonic anhydrase inhibitors. Synthesis of a novel series of 5-substituted 2,4-dichlorobenzenesulfonamides and their inhibition of human cytosolic isozymes I and II and the transmembrane tumor-associated isozymes IX and XII. Eur J Med Chem82:47-55 (2014) 
 
Carbonic anhydrase 2
Name:Carbonic anhydrase 2
Type:Enzyme
Mol. Mass.:29250.71
Organism:Homo sapiens (Human)
Description:P00918
Residue:260
BDBM50019585
NameBDBM50019585
Synonyms:CHEMBL3291094
TypeSmall organic molecule
Emp. Form.C15H11Cl2N3O3S
Mol. Mass.384.237
SMILESCc1ccc(cc1)-c1nnc(o1)-c1cc(c(Cl)cc1Cl)S(N)(=O)=O