Reaction Details
TargetCarbonic anhydrase 2
LigandBDBM50019531
Substrate/Competitorn/a
Meas. Tech.ChEMBL_1366560 (CHEMBL3296583)
Ki 57±n/a nM
Citation Slawinski, JPogorzelska, AZolnowska, BBrozewicz, KVullo, DSupuran, CT Carbonic anhydrase inhibitors. Synthesis of a novel series of 5-substituted 2,4-dichlorobenzenesulfonamides and their inhibition of human cytosolic isozymes I and II and the transmembrane tumor-associated isozymes IX and XII. Eur J Med Chem82:47-55 (2014) 
 
Carbonic anhydrase 2
Name:Carbonic anhydrase 2
Type:Enzyme
Mol. Mass.:29250.71
Organism:Homo sapiens (Human)
Description:P00918
Residue:260
BDBM50019531
NameBDBM50019531
Synonyms:CHEMBL3291099
TypeSmall organic molecule
Emp. Form.C14H13Cl2N3O3S
Mol. Mass.374.242
SMILESNS(=O)(=O)c1cc(NC(=O)NCc2ccccc2)c(Cl)cc1Cl