Reaction Details
TargetCarbonic anhydrase 9
LigandBDBM50019538
Substrate/Competitorn/a
Meas. Tech.ChEMBL_1366561 (CHEMBL3296584)
Ki 27±n/a nM
Citation Slawinski, JPogorzelska, AZolnowska, BBrozewicz, KVullo, DSupuran, CT Carbonic anhydrase inhibitors. Synthesis of a novel series of 5-substituted 2,4-dichlorobenzenesulfonamides and their inhibition of human cytosolic isozymes I and II and the transmembrane tumor-associated isozymes IX and XII. Eur J Med Chem82:47-55 (2014) 
 
Carbonic anhydrase 9
Name:Carbonic anhydrase 9
Type:Enzyme
Mol. Mass.:49669.03
Organism:Homo sapiens (Human)
Description:Catalytic domain of human cloned isozyme was used in the assay
Residue:459
BDBM50019538
NameBDBM50019538
Synonyms:CHEMBL3291106
TypeSmall organic molecule
Emp. Form.C14H11Cl3N4O3S2
Mol. Mass.453.751
SMILESNS(=O)(=O)c1cc(C(=O)NNC(=S)Nc2ccc(Cl)cc2)c(Cl)cc1Cl