Reaction Details
Target5-hydroxytryptamine receptor 2C
LigandBDBM50019660
Substrate/Competitorn/a
Meas. Tech.ChEMBL_1361177 (CHEMBL3292151)
EC50 1460±n/a nM
Citation Storer, RIBrennan, PEBrown, ADBungay, PJConlon, KMCorbett, MSDePianta, RPFish, PVHeifetz, AHo, DKJessiman, ASMcMurray, Gde Oliveira, CARoberts, LRRoot, JAShanmugasundaram, VShapiro, MJSkerten, MWestbrook, DWheeler, SWhitlock, GAWright, J Multiparameter optimization in CNS drug discovery: design of pyrimido[4,5-d]azepines as potent 5-hydroxytryptamine 2C (5-HT2C) receptor agonists with exquisite functional selectivity over 5-HT2A and 5-HT2B receptors. J Med Chem57:5258-69 (2014) 
 
5-hydroxytryptamine receptor 2C
Name:5-hydroxytryptamine receptor 2C
Type:G Protein-Coupled Receptor (GPCR)
Mol. Mass.:51836.79
Organism:Homo sapiens (Human)
Description:P28335
Residue:458
BDBM50019660
NameBDBM50019660
Synonyms:CHEMBL3286558
TypeSmall organic molecule
Emp. Form.C15H17N3O
Mol. Mass.255.315
SMILESOc1nc(Cc2ccccc2)nc2CCNCCc12