Reaction Details
Target5-hydroxytryptamine receptor 2A
LigandBDBM50019662
Substrate/Competitorn/a
Meas. Tech.ChEMBL_1361183 (CHEMBL3292157)
EC50>10000±n/a nM
Citation Storer, RIBrennan, PEBrown, ADBungay, PJConlon, KMCorbett, MSDePianta, RPFish, PVHeifetz, AHo, DKJessiman, ASMcMurray, Gde Oliveira, CARoberts, LRRoot, JAShanmugasundaram, VShapiro, MJSkerten, MWestbrook, DWheeler, SWhitlock, GAWright, J Multiparameter optimization in CNS drug discovery: design of pyrimido[4,5-d]azepines as potent 5-hydroxytryptamine 2C (5-HT2C) receptor agonists with exquisite functional selectivity over 5-HT2A and 5-HT2B receptors. J Med Chem57:5258-69 (2014) 
 
5-hydroxytryptamine receptor 2A
Name:5-hydroxytryptamine receptor 2A
Type:PROTEIN
Mol. Mass.:52384.55
Organism:Canis familiaris
Description:ChEMBL_1361183
Residue:470
BDBM50019662
NameBDBM50019662
Synonyms:CHEMBL3286560
TypeSmall organic molecule
Emp. Form.C16H19N3O
Mol. Mass.269.3416
SMILESCOc1nc(Cc2ccccc2)nc2CCNCCc12