Reaction Details
Target5-hydroxytryptamine receptor 2B
LigandBDBM50019685
Substrate/Competitorn/a
Meas. Tech.ChEMBL_1361193 (CHEMBL3292425)
IC50 67±n/a nM
Citation Storer, RIBrennan, PEBrown, ADBungay, PJConlon, KMCorbett, MSDePianta, RPFish, PVHeifetz, AHo, DKJessiman, ASMcMurray, Gde Oliveira, CARoberts, LRRoot, JAShanmugasundaram, VShapiro, MJSkerten, MWestbrook, DWheeler, SWhitlock, GAWright, J Multiparameter optimization in CNS drug discovery: design of pyrimido[4,5-d]azepines as potent 5-hydroxytryptamine 2C (5-HT2C) receptor agonists with exquisite functional selectivity over 5-HT2A and 5-HT2B receptors. J Med Chem57:5258-69 (2014) 
 
5-hydroxytryptamine receptor 2B
Name:5-hydroxytryptamine receptor 2B
Type:G Protein-Coupled Receptor (GPCR)
Mol. Mass.:54312.47
Organism:Homo sapiens (Human)
Description:Receptor binding assays were performed using human clone stably expressed in CHO cells.
Residue:481
BDBM50019685
NameBDBM50019685
Synonyms:CHEMBL3286556
TypeSmall organic molecule
Emp. Form.C17H22N4
Mol. Mass.282.3834
SMILESCNc1nc(Cc2ccccc2)nc2[C@@H](C)CNCCc12