Reaction Details
TargetBeta-2 adrenergic receptor
LigandBDBM50019696
Substrate/Competitorn/a
Meas. Tech.ChEMBL_1361198 (CHEMBL3292430)
IC50 1400±n/a nM
Citation Storer, RIBrennan, PEBrown, ADBungay, PJConlon, KMCorbett, MSDePianta, RPFish, PVHeifetz, AHo, DKJessiman, ASMcMurray, Gde Oliveira, CARoberts, LRRoot, JAShanmugasundaram, VShapiro, MJSkerten, MWestbrook, DWheeler, SWhitlock, GAWright, J Multiparameter optimization in CNS drug discovery: design of pyrimido[4,5-d]azepines as potent 5-hydroxytryptamine 2C (5-HT2C) receptor agonists with exquisite functional selectivity over 5-HT2A and 5-HT2B receptors. J Med Chem57:5258-69 (2014) 
 
Beta-2 adrenergic receptor
Name:Beta-2 adrenergic receptor
Type:n/a
Mol. Mass.:46461.69
Organism:Homo sapiens (Human)
Description:P07550
Residue:413
BDBM50019696
NameBDBM50019696
Synonyms:CHEMBL3286557
TypeSmall organic molecule
Emp. Form.C16H18F2N4
Mol. Mass.304.3377
SMILESCNc1nc(nc2CCNCCc12)C(F)(F)c1ccccc1