Reaction Details
TargetD(2) dopamine receptor
LigandBDBM50019704
Substrate/Competitorn/a
Meas. Tech.ChEMBL_1361497 (CHEMBL3294601)
Ki 0.650000±n/a nM
Citation Krogsgaard-Larsen, NJensen, AASchrøder, TJChristoffersen, CTKehler, J Novel aza-analogous ergoline derived scaffolds as potent serotonin 5-HT6 and dopamine D2 receptor ligands. J Med Chem57:5823-8 (2014) 
 
D(2) dopamine receptor
Name:D(2) dopamine receptor
Type:Cell-surface receptors
Mol. Mass.:50647.10
Organism:Homo sapiens (Human)
Description:P14416
Residue:443
BDBM50019704
NameBDBM50019704
Synonyms:CHEMBL3286578
TypeSmall organic molecule
Emp. Form.C26H25N3
Mol. Mass.379.4968
SMILESC(N1CCN2C(C1)Cc1c[nH]c3cccc2c13)c1cccc(c1)-c1ccccc1