Reaction Details
Target5-hydroxytryptamine receptor 6
LigandBDBM50019711
Substrate/Competitorn/a
Meas. Tech.ChEMBL_1361507 (CHEMBL3294611)
Ki 0.750000±n/a nM
Citation Krogsgaard-Larsen, NJensen, AASchrøder, TJChristoffersen, CTKehler, J Novel aza-analogous ergoline derived scaffolds as potent serotonin 5-HT6 and dopamine D2 receptor ligands. J Med Chem57:5823-8 (2014) 
 
5-hydroxytryptamine receptor 6
Name:5-hydroxytryptamine receptor 6
Type:G Protein-Coupled Receptor (GPCR)
Mol. Mass.:46968.43
Organism:Homo sapiens (Human)
Description:P50406
Residue:440
BDBM50019711
NameBDBM50019711
Synonyms:CHEMBL3286585
TypeSmall organic molecule
Emp. Form.C19H18FN3O2S
Mol. Mass.371.429
SMILESFc1cccc(c1)S(=O)(=O)n1cc2CC3CNCCN3c3cccc1c23