Reaction Details
TargetRetinal rod rhodopsin-sensitive cGMP 3',5'-cyclic phosphodiesterase subunit delta
LigandBDBM50019796
Substrate/Competitorn/a
Meas. Tech.ChEMBL_1361547 (CHEMBL3294871)
Kd 328±n/a nM
Citation Zimmermann, GSchultz-Fademrecht, CKüchler, PMurarka, SIsmail, STriola, GNussbaumer, PWittinghofer, AWaldmann, H Structure guided design and kinetic analysis of highly potent benzimidazole inhibitors targeting the PDEd prenyl binding site. J Med Chem57:5435-48 (2014) 
 
Retinal rod rhodopsin-sensitive cGMP 3',5'-cyclic phosphodiesterase subunit delta
Name:Retinal rod rhodopsin-sensitive cGMP 3',5'-cyclic phosphodiesterase subunit delta
Type:PROTEIN
Mol. Mass.:17418.30
Organism:Homo sapiens (Human)
Description:ChEMBL_105761
Residue:150
BDBM50019796
NameBDBM50019796
Synonyms:CHEMBL3286888
TypeSmall organic molecule
Emp. Form.C57H66N8O7S
Mol. Mass.1007.248
SMILES[H][C@]12CS[C@@H](CCCCC(=O)NCCCOCCOCCOCCCNC(=O)CC(COc3ccc(cc3)-c3nc4ccccc4n3Cc3ccccc3)n3c(nc4ccccc34)-c3ccccc3)[C@@]1([H])NC(=O)N2