Reaction Details
TargetRetinal rod rhodopsin-sensitive cGMP 3',5'-cyclic phosphodiesterase subunit delta
LigandBDBM50019798
Substrate/Competitorn/a
Meas. Tech.ChEMBL_1361547 (CHEMBL3294871)
Kd>2000±n/a nM
Citation Zimmermann, GSchultz-Fademrecht, CKüchler, PMurarka, SIsmail, STriola, GNussbaumer, PWittinghofer, AWaldmann, H Structure guided design and kinetic analysis of highly potent benzimidazole inhibitors targeting the PDEd prenyl binding site. J Med Chem57:5435-48 (2014) 
 
Retinal rod rhodopsin-sensitive cGMP 3',5'-cyclic phosphodiesterase subunit delta
Name:Retinal rod rhodopsin-sensitive cGMP 3',5'-cyclic phosphodiesterase subunit delta
Type:PROTEIN
Mol. Mass.:17418.30
Organism:Homo sapiens (Human)
Description:ChEMBL_105761
Residue:150
BDBM50019798
NameBDBM50019798
Synonyms:CHEMBL3286889
TypeSmall organic molecule
Emp. Form.C45H45N5O3
Mol. Mass.703.8705
SMILESCC(C)(C)OC(=O)N1CCC(CC1)C(COc1ccc(cc1)-c1nc2ccccc2n1Cc1ccccc1)n1c(nc2ccccc12)-c1ccccc1