Reaction Details
TargetRetinal rod rhodopsin-sensitive cGMP 3',5'-cyclic phosphodiesterase subunit delta
LigandBDBM50019846
Substrate/Competitorn/a
Meas. Tech.ChEMBL_1361547 (CHEMBL3294871)
Kd 9.0±n/a nM
Citation Zimmermann, GSchultz-Fademrecht, CKüchler, PMurarka, SIsmail, STriola, GNussbaumer, PWittinghofer, AWaldmann, H Structure guided design and kinetic analysis of highly potent benzimidazole inhibitors targeting the PDEd prenyl binding site. J Med Chem57:5435-48 (2014) 
 
Retinal rod rhodopsin-sensitive cGMP 3',5'-cyclic phosphodiesterase subunit delta
Name:Retinal rod rhodopsin-sensitive cGMP 3',5'-cyclic phosphodiesterase subunit delta
Type:PROTEIN
Mol. Mass.:17418.30
Organism:Homo sapiens (Human)
Description:ChEMBL_105761
Residue:150
BDBM50019846
NameBDBM50019846
Synonyms:CHEMBL3286912
TypeSmall organic molecule
Emp. Form.C34H40N6O2S
Mol. Mass.596.785
SMILESCCc1nc2ccccc2n1[C@H](COC(=O)C1CCN(CC1)c1nc2ccccc2n1Cc1ccsc1)C1CCNCC1