Reaction Details
TargetIntermediate conductance calcium-activated potassium channel protein 4
LigandBDBM50019904
Substrate/Competitorn/a
Meas. Tech.ChEMBL_1361891 (CHEMBL3293066)
IC50 52±n/a nM
Citation Blass, B Fused Thiazin-3-ones as KCa3.1 Inhibitors. ACS Med Chem Lett5:460-1 (2014) 
 
Intermediate conductance calcium-activated potassium channel protein 4
Name:Intermediate conductance calcium-activated potassium channel protein 4
Type:PROTEIN
Mol. Mass.:47723.22
Organism:Homo sapiens (Human)
Description:ChEMBL_1361891
Residue:427
BDBM50019904
NameBDBM50019904
Synonyms:CHEMBL3287209 | US9533999, ii-1
TypeSmall organic molecule
Emp. Form.C15H11F3N2O2S
Mol. Mass.340.32
SMILESFC(F)(F)Oc1cccc(CN2C(=O)CSc3cccnc23)c1