Reaction Details
TargetGrowth hormone secretagogue receptor type 1
LigandBDBM50019925
Substrate/Competitorn/a
Meas. Tech.ChEMBL_1361893 (CHEMBL3293068)
Ki 17±n/a nM
Citation Bhattacharya, SKAndrews, KBeveridge, RCameron, KOChen, CDunn, MFernando, DGao, HHepworth, DJackson, VMKhot, VKong, JKosa, RELapham, KLoria, PMLondregan, ATMcClure, KFOrr, STPatel, JRose, CSaenz, JStock, IAStorer, GVanVolkenburg, MVrieze, DWang, GXiao, JZhang, Y Discovery of PF-5190457, a Potent, Selective, and Orally Bioavailable Ghrelin Receptor Inverse Agonist Clinical Candidate. ACS Med Chem Lett5:474-9 (2014) 
 
Growth hormone secretagogue receptor type 1
Name:Growth hormone secretagogue receptor type 1
Type:Receptor
Mol. Mass.:41334.57
Organism:Homo sapiens (Human)
Description:Receptor binding studies use plasma membranes from LLC PK-1 cells transiently transfected with hGHSR1a.
Residue:366
BDBM50019925
NameBDBM50019925
Synonyms:CHEMBL3287217
TypeSmall organic molecule
Emp. Form.C29H33N5O2
Mol. Mass.483.6046
SMILESCOc1ccc(CC(=O)N2CCC3(CN(C3)[C@@H]3CCc4cc(ccc34)-c3cc(C)ncn3)CC2)nc1