Reaction Details
TargetPyroglutamylated RF-amide peptide receptor
LigandBDBM50019974
Substrate/Competitorn/a
Meas. Tech.ChEMBL_1363387 (CHEMBL3295522)
IC50 2512±n/a nM
Citation Nordqvist, AKristensson, LJohansson, KEIsaksson da Silva, KFex, TTyrchan, CSvensson Henriksson, ANilsson, K New Hits as Antagonists of GPR103 Identified by HTS. ACS Med Chem Lett5:527-32 (2014) 
 
Pyroglutamylated RF-amide peptide receptor
Name:Pyroglutamylated RF-amide peptide receptor
Type:Enzyme Catalytic Domain
Mol. Mass.:49508.46
Organism:Homo sapiens (Human)
Description:GPR103 0 HUMAN::Q96P65
Residue:431
BDBM50019974
NameBDBM50019974
Synonyms:CHEMBL3287825
TypeSmall organic molecule
Emp. Form.C17H20N2S2
Mol. Mass.316.484
SMILESN=C(Nc1cccc(CSC2CCCC2)c1)c1cccs1