Reaction Details
TargetPyroglutamylated RF-amide peptide receptor
LigandBDBM50019977
Substrate/Competitorn/a
Meas. Tech.ChEMBL_1363387 (CHEMBL3295522)
IC50 3981±n/a nM
Citation Nordqvist, AKristensson, LJohansson, KEIsaksson da Silva, KFex, TTyrchan, CSvensson Henriksson, ANilsson, K New Hits as Antagonists of GPR103 Identified by HTS. ACS Med Chem Lett5:527-32 (2014) 
 
Pyroglutamylated RF-amide peptide receptor
Name:Pyroglutamylated RF-amide peptide receptor
Type:Enzyme Catalytic Domain
Mol. Mass.:49508.46
Organism:Homo sapiens (Human)
Description:GPR103 0 HUMAN::Q96P65
Residue:431
BDBM50019977
NameBDBM50019977
Synonyms:CHEMBL3287828
TypeSmall organic molecule
Emp. Form.C17H19ClN2S2
Mol. Mass.350.929
SMILESClc1ccc(NC(=N)c2cccs2)cc1CSC1CCCC1